Target
Vasopressin V2 receptor
Ligand
BDBM50077032
Substrate
Meas. Tech.
ChEMBL_214722 (CHEMBL817922)
Ki
130±n/a nM
Citation
 Williams, PDBock, MGEvans, BEFreidinger, RMGallicchio, SNGuidotti, MTJacobson, MAKuo, MSLevy, MRLis, EVMichelson, SRPawluczyk, JMPerlow, DSPettibone, DJQuigley, AGReiss, DRSalvatore, CStauffer, KJWoyden, CJ Nonpeptide oxytocin antagonists: analogs of L-371,257 with improved potency. Bioorg Med Chem Lett 9:1311-6 (1999)  
Target
Name:
Vasopressin V2 receptor
Synonyms:
ADHR AVPR2 DIR Renal-type arginine vasopressin receptor V2R_HUMAN Vasopressin V2 receptor | Vasopressin receptor
Type:
Receptor
Mol. Mass.:
40295.28
Organism:
Homo sapiens (Human)
Description:
P30518
Residue:
371
  
Inhibitor
Name:
BDBM50077032
Synonyms:
1-(1-{2-[4-(1-Acetyl-piperidin-4-yloxy)-2-(2,2,2-trifluoro-ethoxy)-phenyl]-acetyl}-piperidin-4-yl)-1,4-dihydro-benzo[d][1,3]oxazin-2-one | CHEMBL24526
Type:
Small organic molecule
Emp. Form.:
C30H34F3N3O6
Mol. Mass.:
589.6027
SMILES:
CC(=O)N1CCC(CC1)Oc1ccc(CC(=O)N2CCC(CC2)N2C(=O)OCc3ccccc23)c(OCC(F)(F)F)c1
: