Target
Oxytocin receptor
Ligand
BDBM50077037
Substrate
Meas. Tech.
ChEBML_149179
Ki
2.1±n/a nM
Citation
 Williams, PDBock, MGEvans, BEFreidinger, RMGallicchio, SNGuidotti, MTJacobson, MAKuo, MSLevy, MRLis, EVMichelson, SRPawluczyk, JMPerlow, DSPettibone, DJQuigley, AGReiss, DRSalvatore, CStauffer, KJWoyden, CJ Nonpeptide oxytocin antagonists: analogs of L-371,257 with improved potency. Bioorg Med Chem Lett 9:1311-6 (1999)  
Target
Name:
Oxytocin receptor
Synonyms:
OT-R Otr Oxytocin
Type:
Enzyme Catalytic Domain
Mol. Mass.:
42889.28
Organism:
RAT
Description:
Oxytocin OXTR RAT::P70536
Residue:
388
  
Inhibitor
Name:
BDBM50077037
Synonyms:
1-(1-{2-[4-(2-Morpholin-4-yl-ethoxy)-2-(2,2,2-trifluoro-ethoxy)-phenyl]-acetyl}-piperidin-4-yl)-1,4-dihydro-benzo[d][1,3]oxazin-2-one | CHEMBL278818
Type:
Small organic molecule
Emp. Form.:
C29H34F3N3O6
Mol. Mass.:
577.592
SMILES:
FC(F)(F)COc1cc(OCCN2CCOCC2)ccc1CC(=O)N1CCC(CC1)N1C(=O)OCc2ccccc12
: