Target
Prothrombin
Ligand
BDBM50066640
Substrate
Meas. Tech.
ChEMBL_208349 (CHEMBL813659)
Ki
37000±n/a nM
Citation
 Phillips, GDavey, DDEagen, KAKoovakkat, SKLiang, ANg, HPPinkerton, MTrinh, LWhitlow, MBeatty, AMMorrissey, MM Design, synthesis, and activity of 2,6-diphenoxypyridine-derived factor Xa inhibitors. J Med Chem 42:1749-56 (1999)  
Target
Name:
Prothrombin
Synonyms:
Activation peptide fragment 1 Coagulation factor II Prothrombin precursor Thrombin heavy chain | Thrombin light chain
Type:
Protein
Mol. Mass.:
70029.57
Organism:
Homo sapiens (Human)
Description:
P00734
Residue:
622
  
Inhibitor
Name:
BDBM50066640
Synonyms:
3-{6-[3-amino(imino)methylphenoxy]-3,5-difluoro-2-pyridyloxy}phenyl-iminomethanamine | CHEMBL424036
Type:
Small organic molecule
Emp. Form.:
C19H15F2N5O2
Mol. Mass.:
383.3515
SMILES:
NC(=N)c1cccc(Oc2nc(Oc3cccc(c3)C(N)=N)c(F)cc2F)c1
: