Target
Acetylcholinesterase
Ligand
BDBM10611
Substrate
Meas. Tech.
ChEMBL_28143 (CHEMBL644927)
IC50
10.3±n/a nM
Citation
 Yu, QHolloway, HWUtsuki, TBrossi, AGreig, NH Synthesis of novel phenserine-based-selective inhibitors of butyrylcholinesterase for Alzheimer's disease. J Med Chem 42:1855-61 (1999)  
Target
Name:
Acetylcholinesterase
Synonyms:
ACES_HUMAN Acetylcholinesterase (AChE) | Acetylcholinesterase (human AChE)
Type:
Enzyme
Mol. Mass.:
67792.70
Organism:
Homo sapiens (Human)
Description:
P22303
Residue:
614
  
Inhibitor
Name:
BDBM10611
Synonyms:
(3aS)-1,3a,8-trimethyl-1H,2H,3H,3aH,8H,8aH-pyrrolo[2,3-b]indol-5-yl N-(2-methylphenyl)carbamate Physostigmine Carbamate 17a
Type:
Small organic molecule
Emp. Form.:
C21H25N3O2
Mol. Mass.:
351.4421
SMILES:
CN1CC[C@]2(C)C1N(C)c1ccc(OC(=O)Nc3ccccc3C)cc21
: