Target
D(2) dopamine receptor
Ligand
BDBM50061669
Substrate
Meas. Tech.
ChEMBL_62888 (CHEMBL675973)
Ki
0.200000±n/a nM
Citation
 Mewshaw, REWebb, MBMarquis, KLMcGaughey, GBShi, XWasik, TScerni, RBrennan, JAAndree, TH New generation dopaminergic agents. 6. Structure-activity relationship studies of a series of 4-(aminoethoxy)indole and 4-(aminoethoxy)indolone derivatives based on the newly discovered 3-hydroxyphenoxyethylamine D2 template. J Med Chem 42:2007-20 (1999)  
Target
Name:
D(2) dopamine receptor
Synonyms:
DOPAMINE D2 DOPAMINE D2 Short Dopamine D2 receptor Drd2
Type:
G Protein-Coupled Receptor (GPCR)
Mol. Mass.:
50931.60
Organism:
Rattus norvegicus (rat)
Description:
P61169
Residue:
444
  
Inhibitor
Name:
BDBM50061669
Synonyms:
(R)-2-(Benzylamino-methyl)-chroman-7-ol; oxalic acid CHEMBL64553
Type:
Small organic molecule
Emp. Form.:
C17H19NO2
Mol. Mass.:
269.3383
SMILES:
Oc1ccc2CC[C@H](CNCc3ccccc3)Oc2c1
: