Target
Muscarinic acetylcholine receptor M3
Ligand
BDBM50239981
Substrate
Meas. Tech.
ChEMBL_1888526 (CHEMBL4390203)
Ki
0.200000±n/a nM
Citation
 Yamashita, YTanaka, KIYamakawa, NAsano, TKanda, YTakafuji, AKawahara, MTakenaga, MFukunishi, YMizushima, T Chemical modification-mediated optimisation of bronchodilatory activity of mepenzolate, a muscarinic receptor antagonist with anti-inflammatory activity. Bioorg Med Chem 27:3339-3346 (2019)  
Target
Name:
Muscarinic acetylcholine receptor M3
Synonyms:
ACM3_HUMAN Cholinergic, muscarinic M3 Muscarinic receptor M3 | RecName: Full=Muscarinic acetylcholine receptor M3
Type:
Enzyme
Mol. Mass.:
66151.03
Organism:
Homo sapiens (Human)
Description:
P20309
Residue:
590
  
Inhibitor
Name:
BDBM50239981
Synonyms:
Braltus Spiriva Respimat | Tiotropium
Type:
Small organic molecule
Emp. Form.:
C19H22NO4S2
Mol. Mass.:
392.512
SMILES:
[H][C@]12O[C@@]1([H])[C@]1([H])C[C@@]([H])(C[C@@]2([H])[N+]1(C)C)OC(=O)C(O)(c1cccs1)c1cccs1
: