Target
Xaa-Pro aminopeptidase 1
Ligand
BDBM50078398
Substrate
Meas. Tech.
ChEMBL_35519 (CHEMBL644752)
IC50
720000±n/a nM
Citation
 Maggiora, LLOrawski, ATSimmons, WH Apstatin analogue inhibitors of aminopeptidase P, a bradykinin-degrading enzyme. J Med Chem 42:2394-402 (1999)  
Target
Name:
Xaa-Pro aminopeptidase 1
Synonyms:
Aminoacylproline aminopeptidase Soluble aminopeptidase P X-prolyl aminopeptidase 1, soluble XPNPEPL XPP1_HUMAN | sAmp
Type:
PROTEIN
Mol. Mass.:
69905.93
Organism:
Homo sapiens (Human)
Description:
ChEMBL_461054
Residue:
623
  
Inhibitor
Name:
BDBM50078398
Synonyms:
2-[(S)-2-((S)-1-Carbamoyl-ethylcarbamoyl)-pyrrolidin-1-yl]-4-phenyl-butyric acid | CHEMBL311925
Type:
Small organic molecule
Emp. Form.:
C18H25N3O4
Mol. Mass.:
347.4088
SMILES:
C[C@H](NC(=O)[C@@H]1CCCN1C(CCc1ccccc1)C(O)=O)C(N)=O
: