Target
Protein arginine N-methyltransferase 5
Ligand
BDBM50523650
Substrate
Meas. Tech.
ChEMBL_1890800 (CHEMBL4392554)
IC50
1.000000±n/a nM
Citation
 Lin, HLuengo, JI Nucleoside protein arginine methyltransferase 5 (PRMT5) inhibitors. Bioorg Med Chem Lett 29:1264-1269 (2019)  
Target
Name:
Protein arginine N-methyltransferase 5
Synonyms:
72 kDa ICln-binding protein HRMT1L5 IBP72 Jak-binding protein 1 PRMT5/MEP50 complex Protein arginine methyltransferase 5 (PRMT5) SKB1 homolog Shk1 kinase-binding protein 1 homolog
Type:
Enzyme
Mol. Mass.:
72679.99
Organism:
Homo sapiens (Human)
Description:
O14744
Residue:
637
  
Inhibitor
Name:
BDBM50523650
Synonyms:
CHEMBL4541232 | US10709709, Example 91
Type:
Small organic molecule
Emp. Form.:
C22H23N5O3
Mol. Mass.:
405.4497
SMILES:
Cc1ncnc2n(ccc12)[C@@H]1C[C@H](Oc2cc(cc3CCNCc23)C#N)[C@@H](O)[C@H]1O
: