Target
Inositol 1,4,5-trisphosphate receptor type 3
Ligand
BDBM50075183
Substrate
Meas. Tech.
ChEBML_90087
pH
7.4±n/a
Kd
195±n/a nM
Comments
extracted
Citation
 Inoue, TKikuchi, KHirose, KIino, MNagano, T Synthesis and evaluation of 1-position-modified inositol 1,4,5-trisphosphate analogs. Bioorg Med Chem Lett 9:1697-702 (1999)  
Target
Name:
Inositol 1,4,5-trisphosphate receptor type 3
Synonyms:
ITPR3 Inositol 1,4,5-trisphosphate receptor | Inositol 1,4,5-trisphosphate receptor type 3
Type:
PROTEIN
Mol. Mass.:
304100.07
Organism:
Homo sapiens (Human)
Description:
ChEMBL_90252
Residue:
2671
  
Inhibitor
Name:
BDBM50075183
Synonyms:
1,4,5-Insp3 1D-myo-inositol 1,4,5-tris(dihydrogen phosphate) 3,5,6-trioxyphosphate-1,2,4-cyclohexanetriol D-myo-inositol 1,4,5-trisphosphate InsP3
Type:
Small organic molecule
Emp. Form.:
C6H15O15P3
Mol. Mass.:
420.0956
SMILES:
O[C@@H]1[C@H](O)[C@@H](OP(O)(O)=O)[C@H](OP(O)(O)=O)[C@@H](O)[C@@H]1OP(O)(O)=O
: