Target
Adenosine kinase
Ligand
BDBM50524391
Substrate
Meas. Tech.
ChEMBL_1892980 (CHEMBL4394901)
Ki
5100±n/a nM
Citation
 Crespo, RADang, QZhou, NEGuthrie, LMSnavely, TCDong, WLoesch, KASuzuki, TYou, LWang, WO'Malley, TParish, TOlsen, DBSacchettini, JC Structure-Guided Drug Design of 6-Substituted Adenosine Analogues as Potent Inhibitors of Mycobacterium tuberculosis Adenosine Kinase. J Med Chem 62:4483-4499 (2019)  
Target
Name:
Adenosine kinase
Synonyms:
ADK | ADK_HUMAN
Type:
PROTEIN
Mol. Mass.:
40545.97
Organism:
Homo sapiens (Human)
Description:
ChEMBL_1467841
Residue:
362
  
Inhibitor
Name:
BDBM50524391
Synonyms:
CHEMBL2042164
Type:
Small organic molecule
Emp. Form.:
C20H24N6O4
Mol. Mass.:
412.4424
SMILES:
OC[C@H]1O[C@H]([C@H](O)[C@@H]1O)n1cnc2c(ncnc12)N1CCN(CC1)c1ccccc1
: