Target
Acetolactate synthase, chloroplastic
Ligand
BDBM50216780
Substrate
Meas. Tech.
ChEBML_27494
IC50
208000±n/a nM
Comments
modified from 55 20220121
Citation
 Liu, JLi, ZYan, HWang, LChen, J The design and synthesis of ALS inhibitors from pharmacophore models. Bioorg Med Chem Lett 9:1927-32 (1999)  
Target
Name:
Acetolactate synthase, chloroplastic
Synonyms:
AHAS Acetolactate synthase ILVB_ARATH | TZP5
Type:
PROTEIN
Mol. Mass.:
72585.19
Organism:
Arabidopsis thaliana
Description:
ChEMBL_934103
Residue:
670
  
Inhibitor
Name:
BDBM50216780
Synonyms:
CHEMBL58352
Type:
Small organic molecule
Emp. Form.:
C12H10N2O4
Mol. Mass.:
246.2188
SMILES:
O=C(OCn1ccc(=O)[nH]c1=O)c1ccccc1
: