Target
Protein farnesyltransferase subunit beta/geranylgeranyltransferase type-1 subunit alpha
Ligand
BDBM50079667
Substrate
Meas. Tech.
ChEBML_70134
IC50
0.410000±n/a nM
Citation
 Ciccarone, TMMacTough, SCWilliams, TMDinsmore, CJO'Neill, TJShah, DCulberson, JCKoblan, KSKohl, NEGibbs, JBOliff, AIGraham, SLHartman, GD Non-thiol 3-aminomethylbenzamide inhibitors of farnesyl-protein transferase. Bioorg Med Chem Lett 9:1991-6 (1999)  
Target
Name:
Protein farnesyltransferase subunit beta/geranylgeranyltransferase type-1 subunit alpha
Synonyms:
Farnesyltransferase (FTase) Protein Farnesyltransferase (PFT) Chain B | Protein farnesyltransferase
Type:
Protein Complex
Mol. Mass.:
Description:
To express recombinant enzyme in E. coli, the cloned human alpha and beta subunits were co-expressed from a plasmid, in which their expression was translationally coupled.
Components:
This complex has 2 components.
Component 1
Name:
Protein farnesyltransferase subunit beta
Synonyms:
CAAX farnesyltransferase subunit alpha FNTB FTase-alpha GGTase-I-alpha Protein farnesyl/geranylgeranyl transferase Protein farnesyltransferase subunit beta Protein farnesyltransferase/geranylgeranyltransferase type-1 subunit alpha Ras proteins prenyltransferase subunit beta | Type I protein geranyl-geranyltransferase subunit alpha
Type:
Enzyme Subunit
Mol. Mass.:
48766.02
Organism:
Homo sapiens (Human)
Description:
Protein farnesyltransferase subunit beta
Residue:
437
  
Component 2
Name:
Protein farnesyltransferase/geranylgeranyltransferase type-1 subunit alpha
Synonyms:
CAAX farnesyltransferase alpha subunit FNTA_HUMAN FTase-alpha Geranylgeranyl Transferase (GGTase-I) Chain A Protein Farnesyltransferase (PFT) Chain A Protein farnesyltransferase Protein farnesyltransferase/geranylgeranyltransferase type I alpha subunit | Ras proteins prenyltransferase alpha
Type:
Enzyme
Mol. Mass.:
44392.46
Organism:
Homo sapiens (Human)
Description:
Recombinant human FTase.
Residue:
379
  
Inhibitor
Name:
BDBM50079667
Synonyms:
(S)-2-[3-({(4-Cyano-benzyl)-[3-(4-cyano-benzyl)-3H-imidazol-4-ylmethyl]-amino}-methyl)-benzoylamino]-4-methylsulfanyl-butyric acid | CHEMBL61785
Type:
Small organic molecule
Emp. Form.:
C33H32N6O3S
Mol. Mass.:
592.711
SMILES:
CSCC[C@H](NC(=O)c1cccc(CN(Cc2cncn2Cc2ccc(cc2)C#N)Cc2ccc(cc2)C#N)c1)C(O)=O
: