Target
Cone cGMP-specific 3',5'-cyclic phosphodiesterase subunit alpha'
Ligand
BDBM14777
Substrate
Meas. Tech.
ChEMBL_1895406 (CHEMBL4397441)
IC50
402±n/a nM
Citation
 Wang, ZJiang, XZhang, XTian, GYang, RWu, JZou, XLiu, ZYang, XWu, CShi, JLi, JSuo, JWang, YZhang, RXu, ZGong, XHe, YZhu, WAisa, HAJiang, HXu, YShen, J Pharmacokinetics-Driven Optimization of 4(3 H)-Pyrimidinones as Phosphodiesterase Type 5 Inhibitors Leading to TPN171, a Clinical Candidate for the Treatment of Pulmonary Arterial Hypertension. J Med Chem 62:4979-4990 (2019)  
Target
Name:
Cone cGMP-specific 3',5'-cyclic phosphodiesterase subunit alpha'
Synonyms:
3',5'-cyclic phosphodiesterase PDE6C_HUMAN Phosphodiesterase 6C | Phosphodiesterase 6C (PDE6C)
Type:
Protein
Mol. Mass.:
99132.02
Organism:
Homo sapiens (Human)
Description:
P51160
Residue:
858
  
Inhibitor
Name:
BDBM14777
Synonyms:
(2R,8R)-2-(2H-1,3-benzodioxol-5-yl)-6-methyl-3,6,17-triazatetracyclo[8.7.0.0^{3,8}.0^{11,16}]heptadeca-1(10),11(16),12,14-tetraene-4,7-dione CHEMBL779 GF 196960 | Tadalafil
Type:
Small organic molecule
Emp. Form.:
C22H19N3O4
Mol. Mass.:
389.404
SMILES:
[H][C@]12Cc3c([nH]c4ccccc34)[C@H](N1C(=O)CN(C)C2=O)c1ccc2OCOc2c1
: