Target
H2-K region expressed gene 2, rat orthologue
Ligand
BDBM50079823
Substrate
Meas. Tech.
ChEBML_103872
IC50
270±n/a nM
Citation
 Jones, ABActon, JJRivetna, MNCummings, RTCubbon, RMNichols, EASchwartz, CDWicker, LSHermes, JD Tetrapeptide derived inhibitors of complexation of a class II MHC: the peptide backbone is not inviolate. Bioorg Med Chem Lett 9:2109-14 (1999)  
Target
Name:
H2-K region expressed gene 2, rat orthologue
Synonyms:
MHC class II | MHC class II region expressed gene KE2, isoform CRA_a
Type:
PROTEIN
Mol. Mass.:
14499.39
Organism:
Rattus norvegicus
Description:
ChEMBL_10342
Residue:
127
  
Inhibitor
Name:
BDBM50079823
Synonyms:
((S)-1-{(S)-1-[(S)-1-((S)-1-Carbamoyl-3-methyl-butylcarbamoyl)-ethylcarbamoyl]-ethylcarbamoyl}-2-phenyl-ethyl)-carbamic acid ethyl ester | CHEMBL65081
Type:
Small organic molecule
Emp. Form.:
C24H37N5O6
Mol. Mass.:
491.5805
SMILES:
CCOC(=O)N[C@@H](Cc1ccccc1)C(=O)N[C@@H](C)C(=O)N[C@@H](C)C(=O)N[C@@H](CC(C)C)C(N)=O
: