Target
Cyclin-dependent kinase 5 activator 1
Ligand
BDBM50525163
Substrate
Meas. Tech.
ChEMBL_1895830 (CHEMBL4397865)
Ki
2030±n/a nM
Citation
 Khair, NZLenjisa, JLTadesse, SKumarasiri, MBasnet, SKCMekonnen, LBLi, MDiab, SSykes, MJAlbrecht, HMilne, RWang, S Discovery of CDK5 Inhibitors through Structure-Guided Approach. ACS Med Chem Lett 10:786-791 (2019)  
Target
Name:
Cyclin-dependent kinase 5 activator 1
Synonyms:
CDK5/p35 Cyclin-dependent kinase 5 regulatory subunit 1 | Cyclin-dependent kinase 5/CDK5 activator 1
Type:
Protein Complex
Mol. Mass.:
Description:
Components:
This complex has 2 components.
Component 1
Name:
Cyclin-dependent kinase 5
Synonyms:
CDK5 CDKN5 Cyclin-dependent kinase 5 (CDK5/ p25) Cyclin-dependent-like kinase 5 PSSALRE Tau protein kinase II catalytic subunit
Type:
Enzyme Subunit
Mol. Mass.:
33308.61
Organism:
Homo sapiens (Human)
Description:
Residue:
292
  
Component 2
Name:
Cyclin-dependent kinase 5 activator 1
Synonyms:
CD5R1_HUMAN CDK5R1 Cyclin-dependent kinase 5 (CDK5/p25) NCK5A p35
Type:
Enzyme Subunit
Mol. Mass.:
34077.43
Organism:
Homo sapiens (Human)
Description:
Q15078
Residue:
307
  
Inhibitor
Name:
BDBM50525163
Synonyms:
CHEMBL4566271
Type:
Small organic molecule
Emp. Form.:
C19H20N4O
Mol. Mass.:
320.3883
SMILES:
O=C(Nc1cccc(CN2CCCC2)c1)c1n[nH]c2ccccc12
: