Target
Rho-associated protein kinase 1/2
Ligand
BDBM50525584
Substrate
Meas. Tech.
ChEMBL_1897554 (CHEMBL4399589)
Ki
6.0±n/a nM
Citation
 Collier, PNTwin, HCKnegtel, RMABoyall, DBrenchley, GDavis, CJKeily, SMak, CMiller, APierard, FSettimo, LBolton, CMChiu, PCurnock, ADoyle, ETanner, AJJimenez, JM Discovery of Selective, Orally Bioavailable Pyrazolopyridine Inhibitors of Protein Kinase C? (PKC?) That Ameliorate Symptoms of Experimental Autoimmune Encephalomyelitis. ACS Med Chem Lett 10:1134-1139 (2019)  
Target
Name:
Rho-associated protein kinase 1/2
Synonyms:
Rho-associated protein kinase Rho-associated protein kinase 2/Rho-kinase (ROCK I)
Type:
Mol. Mass.:
Description:
ASSAY_ID of EBI is 432392
Components:
This complex has 2 components.
Component 1
Name:
Rho-associated protein kinase 1
Synonyms:
ROCK-I ROCK1_HUMAN Rho-associated protein kinase Rho-associated, coiled-coil-containing protein kinase 1 Rho-kinase (ROCK I) p160 ROCK-1 | p160ROCK
Type:
Serine/threonine-protein kinase
Mol. Mass.:
158156.77
Organism:
Homo sapiens (Human)
Description:
Q13464
Residue:
1354
  
Component 2
Name:
Rho-associated protein kinase 2
Synonyms:
KIAA0619 ROCK2 Rho kinase 2 (ROCKII) Rho-associated protein kinase 2 (ROCK2) Rho-associated protein kinase 2/Transforming protein RhoA Rho-associated, coiled-coil-containing protein kinase II p164 ROCK-2
Type:
Protein
Mol. Mass.:
160885.43
Organism:
Homo sapiens (Human)
Description:
O75116
Residue:
1388
  
Component 3
Name:
Rho-associated protein kinase 2
Synonyms:
KIAA0619 ROCK2 Rho kinase 2 (ROCKII) Rho-associated protein kinase 2 (ROCK2) Rho-associated protein kinase 2/Transforming protein RhoA Rho-associated, coiled-coil-containing protein kinase II p164 ROCK-2
Type:
Protein
Mol. Mass.:
160885.43
Organism:
Homo sapiens (Human)
Description:
O75116
Residue:
1388
  
Inhibitor
Name:
BDBM50525584
Synonyms:
CHEMBL4453941
Type:
Small organic molecule
Emp. Form.:
C16H14N4
Mol. Mass.:
262.3092
SMILES:
CC(C)(C#N)c1cccc(n1)-c1ccnc2[nH]ccc12
: