Target
Mu-type opioid receptor
Ligand
BDBM50080453
Substrate
Meas. Tech.
ChEMBL_148833 (CHEMBL753951)
Ki
0.94±n/a nM
Citation
 Schiller, PWFundytus, MEMerovitz, LWeltrowska, GNguyen, TMLemieux, CChung, NNCoderre, TJ The opioid mu agonist/delta antagonist DIPP-NH(2)[Psi] produces a potent analgesic effect, no physical dependence, and less tolerance than morphine in rats. J Med Chem 42:3520-6 (1999)  
Target
Name:
Mu-type opioid receptor
Synonyms:
MOR-1 Mu-type opioid receptor (MOR) OPRM_RAT Opioid receptor B Ror-b
Type:
G Protein-Coupled Receptor (GPCR)
Mol. Mass.:
44503.11
Organism:
Rattus norvegicus (rat)
Description:
Competition binding assays were carried out using membrane preparations from transfected HN9.10 cells that constitutively expressed the mu opioid receptor.
Residue:
398
  
Inhibitor
Name:
BDBM50080453
Synonyms:
(S)-2-({2-[(S)-2-Amino-3-(4-hydroxy-2,6-dimethyl-phenyl)-propionyl]-1,2,3,4-tetrahydro-isoquinolin-3-ylmethyl}-amino)-N-((S)-1-carbamoyl-2-phenyl-ethyl)-3-phenyl-propionamide | CHEMBL119590
Type:
Small organic molecule
Emp. Form.:
C39H45N5O4
Mol. Mass.:
647.8057
SMILES:
Cc1cc(O)cc(C)c1C[C@H](N)C(=O)N1Cc2ccccc2CC1CN[C@@H](Cc1ccccc1)C(=O)N[C@@H](Cc1ccccc1)C(N)=O
: