Target
Mu-type opioid receptor
Ligand
BDBM50080455
Substrate
Meas. Tech.
ChEMBL_148833 (CHEMBL753951)
Ki
76±n/a nM
Citation
 Schiller, PWFundytus, MEMerovitz, LWeltrowska, GNguyen, TMLemieux, CChung, NNCoderre, TJ The opioid mu agonist/delta antagonist DIPP-NH(2)[Psi] produces a potent analgesic effect, no physical dependence, and less tolerance than morphine in rats. J Med Chem 42:3520-6 (1999)  
Target
Name:
Mu-type opioid receptor
Synonyms:
MOR-1 Mu-type opioid receptor (MOR) OPRM_RAT Opioid receptor B Ror-b
Type:
G Protein-Coupled Receptor (GPCR)
Mol. Mass.:
44503.11
Organism:
Rattus norvegicus (rat)
Description:
Competition binding assays were carried out using membrane preparations from transfected HN9.10 cells that constitutively expressed the mu opioid receptor.
Residue:
398
  
Inhibitor
Name:
BDBM50080455
Synonyms:
(S)-N-((S)-1-Carbamoyl-2-phenyl-ethyl)-2-({2-[(S)-3-(4-hydroxy-2,6-dimethyl-phenyl)-2-methylamino-propionyl]-1,2,3,4-tetrahydro-isoquinolin-3-ylmethyl}-amino)-3-phenyl-propionamide | CHEMBL119535
Type:
Small organic molecule
Emp. Form.:
C40H47N5O4
Mol. Mass.:
661.8323
SMILES:
CN[C@@H](Cc1c(C)cc(O)cc1C)C(=O)N1Cc2ccccc2CC1CN[C@@H](Cc1ccccc1)C(=O)N[C@@H](Cc1ccccc1)C(N)=O
: