Target
Proto-oncogene tyrosine-protein kinase ROS
Ligand
BDBM50525834
Substrate
Meas. Tech.
ChEMBL_1898286 (CHEMBL4400321)
IC50
0.970000±n/a nM
Citation
 Lei, HJia, FCao, MWang, JGuo, MZhu, MZuo, DZhai, X An exploration of solvent-front region high affinity moiety leading to novel potent ALK & ROS1 dual inhibitors with mutant-combating effects. Bioorg Med Chem 27:0 (2019)  
Target
Name:
Proto-oncogene tyrosine-protein kinase ROS
Synonyms:
MCF3 Proto-oncogene c-Ros-1 ROS1 Receptor tyrosine kinase c-ros oncogene 1 c-Ros receptor tyrosine kinase
Type:
Enzyme
Mol. Mass.:
263897.39
Organism:
Homo sapiens (Human)
Description:
P08922
Residue:
2347
  
Inhibitor
Name:
BDBM50525834
Synonyms:
CHEMBL4448400
Type:
Small organic molecule
Emp. Form.:
C24H26ClN7O3
Mol. Mass.:
495.961
SMILES:
COc1cc(NC(=O)N2CCCC2)ccc1Nc1ncc(Cl)c(Nc2ccccc2NC(C)=O)n1
: