Target
Prothrombin
Ligand
BDBM50080882
Substrate
Meas. Tech.
ChEBML_208526
Ki
0.060000±n/a nM
Citation
 Lee, KJung, WHHwang, SYLee, SH Fluorobenzamidrazone thrombin inhibitors: influence of fluorine on enhancing oral absorption. Bioorg Med Chem Lett 9:2483-6 (1999)  
Target
Name:
Prothrombin
Synonyms:
Activation peptide fragment 1 Coagulation factor II Prothrombin precursor Thrombin heavy chain | Thrombin light chain
Type:
Protein
Mol. Mass.:
70029.57
Organism:
Homo sapiens (Human)
Description:
P00734
Residue:
622
  
Inhibitor
Name:
BDBM50080882
Synonyms:
Benzamidrazone analogue | CHEMBL312244
Type:
Small organic molecule
Emp. Form.:
C27H33N5O4S
Mol. Mass.:
523.647
SMILES:
COc1ccc2cc(ccc2c1)S(=O)(=O)N[C@@H](Cc1ccc(cc1)C(N)=NN)C(=O)N(C)C1CCCC1
: