Target
Prothrombin
Ligand
BDBM50080905
Substrate
Meas. Tech.
ChEMBL_208354 (CHEMBL813664)
Ki
43±n/a nM
Citation
 Cody, WLCai, CDoherty, AMEdmunds, JJHe, JXNarasimhan, LSPlummer, JSRapundalo, STRubin, JRVan Huis, CASt-Denis, YWinocour, PDSiddiqui, MA The design of potent and selective inhibitors of thrombin utilizing a piperazinedione template: part 1. Bioorg Med Chem Lett 9:2497-502 (1999)  
Target
Name:
Prothrombin
Synonyms:
Activation peptide fragment 1 Coagulation factor II Prothrombin precursor Thrombin heavy chain | Thrombin light chain
Type:
Protein
Mol. Mass.:
70029.57
Organism:
Homo sapiens (Human)
Description:
P00734
Residue:
622
  
Inhibitor
Name:
BDBM50080905
Synonyms:
CHEMBL83681 | N-[(S)-1-(1-Carbamimidoyl-piperidin-3-ylmethyl)-2-oxo-2-thiazol-2-yl-ethyl]-2-[(S)-2-(4-methoxy-benzyl)-3,6-dioxo-4-(3-phenyl-propyl)-piperazin-1-yl]-acetamide
Type:
Small organic molecule
Emp. Form.:
C35H43N7O5S
Mol. Mass.:
673.825
SMILES:
COc1ccc(C[C@@H]2N(CC(=O)N[C@@H](CC3CCCN(C3)C(N)=N)C(=O)c3nccs3)C(=O)CN(CCCc3ccccc3)C2=O)cc1
: