Target
Prothrombin
Ligand
BDBM50080916
Substrate
Meas. Tech.
ChEMBL_208527 (CHEMBL873984)
Ki
20±n/a nM
Citation
 Cody, WLAugelli-Szafran, CEBerryman, KACai, CDoherty, AMEdmunds, JJHe, JXNarasimhan, LSPenvose-Yi, JPlummer, JSRapundalo, STRubin, JRVan Huis, CALeblond, LWinocour, PDSiddiqui, MA The design of potent and selective inhibitors of thrombin utilizing a piperazinedione template: part 2. Bioorg Med Chem Lett 9:2503-8 (1999)  
Target
Name:
Prothrombin
Synonyms:
Activation peptide fragment 1 Coagulation factor II Prothrombin precursor Thrombin heavy chain | Thrombin light chain
Type:
Protein
Mol. Mass.:
70029.57
Organism:
Homo sapiens (Human)
Description:
P00734
Residue:
622
  
Inhibitor
Name:
BDBM50080916
Synonyms:
CHEMBL84084 | N-[(S)-1-(1-Carbamimidoyl-piperidin-3-ylmethyl)-2-oxo-2-thiazol-2-yl-ethyl]-2-[(R)-2-(3-chloro-benzyl)-3,6-dioxo-4-(3-phenyl-propyl)-piperazin-1-yl]-acetamide
Type:
Small organic molecule
Emp. Form.:
C34H40ClN7O4S
Mol. Mass.:
678.244
SMILES:
NC(=N)N1CCCC(C[C@H](NC(=O)CN2[C@H](Cc3cccc(Cl)c3)C(=O)N(CCCc3ccccc3)CC2=O)C(=O)c2nccs2)C1
: