Target
17-beta-hydroxysteroid dehydrogenase type 2
Ligand
BDBM50525968
Substrate
Meas. Tech.
ChEMBL_1898526 (CHEMBL4400641)
IC50
0.200000±n/a nM
Citation
 Abdelsamie, ASHerath, SBiskupek, YBörger, CSiebenbürger, LSalah, MScheuer, CMarchais-Oberwinkler, SFrotscher, MPohlemann, TMenger, MDHartmann, RWLaschke, MWvan Koppen, CJ Targeted Endocrine Therapy: Design, Synthesis, and Proof-of-Principle of 17?-Hydroxysteroid Dehydrogenase Type 2 Inhibitors in Bone Fracture Healing. J Med Chem 62:1362-1372 (2019)  
Target
Name:
17-beta-hydroxysteroid dehydrogenase type 2
Synonyms:
17-beta-Hydroxysteroid Dehydrogenase 2 (17-beta-HSD2) 20-alpha-HSD EDH17B2 Estradiol 17-beta-dehydrogenase 2 (17beta-HSD2) Microsomal 17-beta-hydroxysteroid dehydrogenas Testosterone 17-beta-dehydrogenase
Type:
Oxidoreductase; single-pass type II membrane protein
Mol. Mass.:
42795.29
Organism:
Homo sapiens (Human)
Description:
Enzyme was partially purified from human placenta.
Residue:
387
  
Inhibitor
Name:
BDBM50525968
Synonyms:
CHEMBL4457145
Type:
Small organic molecule
Emp. Form.:
C24H16F3NO4S2
Mol. Mass.:
503.513
SMILES:
Cc1ccc(cc1)S(=O)(=O)Nc1cccc(c1)-c1ccc(s1)C(=O)c1cc(F)c(F)c(O)c1F
: