Target
Estradiol 17-beta-dehydrogenase 2
Ligand
BDBM50525971
Substrate
Meas. Tech.
ChEMBL_1898529 (CHEMBL4400644)
IC50
2.7±n/a nM
Citation
 Abdelsamie, ASHerath, SBiskupek, YBörger, CSiebenbürger, LSalah, MScheuer, CMarchais-Oberwinkler, SFrotscher, MPohlemann, TMenger, MDHartmann, RWLaschke, MWvan Koppen, CJ Targeted Endocrine Therapy: Design, Synthesis, and Proof-of-Principle of 17?-Hydroxysteroid Dehydrogenase Type 2 Inhibitors in Bone Fracture Healing. J Med Chem 62:1362-1372 (2019)  
Target
Name:
Estradiol 17-beta-dehydrogenase 2
Synonyms:
17-beta-HSD 2 DHB2_MOUSE Hsd17b2 | Testosterone 17-beta-dehydrogenase
Type:
PROTEIN
Mol. Mass.:
41847.95
Organism:
Mus musculus
Description:
ChEMBL_104366
Residue:
381
  
Inhibitor
Name:
BDBM50525971
Synonyms:
CHEMBL4574253
Type:
Small organic molecule
Emp. Form.:
C23H16ClNO4S2
Mol. Mass.:
469.96
SMILES:
Oc1cccc(C(=O)c2ccc(s2)-c2cccc(NS(=O)(=O)c3ccccc3)c2)c1Cl
: