Target
D(2) dopamine receptor
Ligand
BDBM50081107
Substrate
Meas. Tech.
ChEMBL_61465 (CHEMBL671446)
Ki
0.210000±n/a nM
Citation
 Mewshaw, RENelson, JAShah, USShi, XMazandarani, HCoupet, JMarquis, KBrennan, JAAndree, TH New generation dopaminergic agents. 7. Heterocyclic bioisosteres that exploit the 3-OH-phenoxyethylamine D2 template. Bioorg Med Chem Lett 9:2593-8 (1999)  
Target
Name:
D(2) dopamine receptor
Synonyms:
DOPAMINE D2 DOPAMINE D2 Short Dopamine D2 receptor Drd2
Type:
G Protein-Coupled Receptor (GPCR)
Mol. Mass.:
50931.60
Organism:
Rattus norvegicus (rat)
Description:
P61169
Residue:
444
  
Inhibitor
Name:
BDBM50081107
Synonyms:
4-(2-Benzylamino-ethoxy)-6-chloro-1,3-dihydro-benzoimidazole-2-thione | CHEMBL89037
Type:
Small organic molecule
Emp. Form.:
C16H16ClN3OS
Mol. Mass.:
333.836
SMILES:
Clc1cc(OCCNCc2ccccc2)c2[nH]c(=S)[nH]c2c1
: