Target
Thymidylate synthase
Ligand
BDBM50081239
Substrate
Meas. Tech.
ChEMBL_209961 (CHEMBL820617)
IC50
2±n/a nM
Citation
 Marsham, PRWardleworth, JMBoyle, FTHennequin, LFKimbell, RBrown, MJackman, AL Design and synthesis of potent non-polyglutamatable quinazoline antifolate thymidylate synthase inhibitors. J Med Chem 42:3809-20 (1999)  
Target
Name:
Thymidylate synthase
Synonyms:
TS TYSY_MOUSE | Tyms
Type:
PROTEIN
Mol. Mass.:
34957.15
Organism:
Mus musculus
Description:
ChEMBL_1340097
Residue:
307
  
Inhibitor
Name:
BDBM50081239
Synonyms:
(S)-2-{4-[(2,7-Dimethyl-4-oxo-3,4-dihydro-quinazolin-6-ylmethyl)-prop-2-ynyl-amino]-2-fluoro-benzoylamino}-3-(1H-tetrazol-5-ylsulfanyl)-propionic acid | CHEMBL338598
Type:
Small organic molecule
Emp. Form.:
C25H23FN8O4S
Mol. Mass.:
550.565
SMILES:
Cc1nc2cc(C)c(CN(CC#C)c3ccc(C(=O)N[C@H](CSc4nnn[nH]4)C(O)=O)c(F)c3)cc2c(=O)[nH]1
: