Target
Thymidylate synthase
Ligand
BDBM50081257
Substrate
Meas. Tech.
ChEMBL_209961 (CHEMBL820617)
IC50
7.2±n/a nM
Citation
 Marsham, PRWardleworth, JMBoyle, FTHennequin, LFKimbell, RBrown, MJackman, AL Design and synthesis of potent non-polyglutamatable quinazoline antifolate thymidylate synthase inhibitors. J Med Chem 42:3809-20 (1999)  
Target
Name:
Thymidylate synthase
Synonyms:
TS TYSY_MOUSE | Tyms
Type:
PROTEIN
Mol. Mass.:
34957.15
Organism:
Mus musculus
Description:
ChEMBL_1340097
Residue:
307
  
Inhibitor
Name:
BDBM50081257
Synonyms:
(S)-5-Benzoylsulfamoyl-2-{4-[(2,7-dimethyl-4-oxo-3,4-dihydro-quinazolin-6-ylmethyl)-prop-2-ynyl-amino]-2-fluoro-benzoylamino}-pentanoic acid | CHEMBL341262
Type:
Small organic molecule
Emp. Form.:
C33H32FN5O7S
Mol. Mass.:
661.7
SMILES:
Cc1nc2cc(C)c(CN(CC#C)c3ccc(C(=O)N[C@@H](CCCS(=O)(=O)NC(=O)c4ccccc4)C(O)=O)c(F)c3)cc2c(=O)[nH]1
: