Target
Hematopoietic prostaglandin D synthase
Ligand
BDBM50526494
Substrate
Meas. Tech.
ChEMBL_1900120 (CHEMBL4402235)
IC50
8.2±n/a nM
Citation
 Deaton, DNDo, YHolt, JJeune, MRKramer, HFLarkin, ALOrband-Miller, LAPeckham, GEPoole, CPrice, DJSchaller, LTShen, YShewchuk, LMStewart, ELStuart, JDThomson, SAWard, PWilson, JWXu, TGuss, JHMusetti, CRendina, ARAffleck, KAnders, DHancock, APHobbs, HHodgson, STHutchinson, JLeveridge, MVNicholls, HSmith, IEDSomers, DOSneddon, HFUddin, SCleasby, AMortenson, PNRichardson, CSaxty, G The discovery of quinoline-3-carboxamides as hematopoietic prostaglandin D synthase (H-PGDS) inhibitors. Bioorg Med Chem 27:1456-1478 (2019)  
Target
Name:
Hematopoietic prostaglandin D synthase
Synonyms:
GSTS Glutathione-requiring prostaglandin D synthase HPGDS Hematopoietic prostaglandin D synthase Hematopoietic prostaglandin D synthase (HPGDS) PTGDS2 Prostaglandin D Synthase
Type:
Enzyme
Mol. Mass.:
23341.07
Organism:
Homo sapiens (Human)
Description:
The protein was expressed in E. coli strain BL21(DE3) with an N-terminal 6-His tag.
Residue:
199
  
Inhibitor
Name:
BDBM50526494
Synonyms:
CHEMBL4439454
Type:
Small organic molecule
Emp. Form.:
C21H26N2O3
Mol. Mass.:
354.4427
SMILES:
COc1ccc2cc(cnc2c1)C(=O)NC1CC2(C1)CC(C2)C(C)(C)O
: