Target
Non-receptor tyrosine-protein kinase TYK2
Ligand
BDBM50526606
Substrate
Meas. Tech.
ChEMBL_1900329 (CHEMBL4402444)
Ki
0.086000±n/a nM
Target
Name:
Non-receptor tyrosine-protein kinase TYK2
Synonyms:
Non-receptor tyrosine-protein kinase TYK2 (TYK2) TYK2_HUMAN | Tyrosine-protein kinase TYK2
Type:
Protein
Mol. Mass.:
133666.03
Organism:
Homo sapiens (Human)
Description:
P29597
Residue:
1187
  
Inhibitor
Name:
BDBM50526606
Synonyms:
CHEMBL4532948 | US11174264, Compound I-3
Type:
Small organic molecule
Emp. Form.:
C21H19FN8O2
Mol. Mass.:
434.4264
SMILES:
CNc1cc(Nc2cccn(-c3ccccn3)c2=O)nn2c(cnc12)C(=O)N[C@@H]1C[C@@H]1F
: