Target
Non-receptor tyrosine-protein kinase TYK2
Ligand
BDBM50526624
Substrate
Meas. Tech.
ChEMBL_1900329 (CHEMBL4402444)
Ki
0.091000±n/a nM
Target
Name:
Non-receptor tyrosine-protein kinase TYK2
Synonyms:
Non-receptor tyrosine-protein kinase TYK2 (TYK2) TYK2_HUMAN | Tyrosine-protein kinase TYK2
Type:
Protein
Mol. Mass.:
133666.03
Organism:
Homo sapiens (Human)
Description:
P29597
Residue:
1187
  
Inhibitor
Name:
BDBM50526624
Synonyms:
CHEMBL4443010
Type:
Small organic molecule
Emp. Form.:
C21H21N9O2
Mol. Mass.:
431.4505
SMILES:
CNc1cc(Nc2cccn(-c3ccc(C)nn3)c2=O)nn2c(cnc12)C(=O)NC1CC1
: