Target
Beta-1 adrenergic receptor
Ligand
BDBM25756
Substrate
Meas. Tech.
ChEMBL_1900545 (CHEMBL4402767)
Ki
49±n/a nM
Citation
 Schwalbe, THuebner, HGmeiner, P Development of covalent antagonists for ?1- and ?2-adrenergic receptors. Bioorg Med Chem 27:2959-2971 (2019)  
Target
Name:
Beta-1 adrenergic receptor
Synonyms:
ADRB1_MOUSE Adrb1r Beta-1 adrenergic receptor Beta-1 adrenoreceptor
Type:
PROTEIN
Mol. Mass.:
50507.75
Organism:
Mus musculus
Description:
ChEMBL_105090
Residue:
466
  
Inhibitor
Name:
BDBM25756
Synonyms:
(2R,3R)-2,3-dihydroxysuccinic acid;1-(isopropylamino)-3-[4-(2-methoxyethyl)phenoxy]propan-2-ol CHEMBL13 Spesicor metoprolol tartrate | {2-hydroxy-3-[4-(2-methoxyethyl)phenoxy]propyl}(propan-2-yl)amine
Type:
Small organic molecule
Emp. Form.:
C15H25NO3
Mol. Mass.:
267.3639
SMILES:
COCCc1ccc(OCC(O)CNC(C)C)cc1
: