Target
Adenosine receptor A2a
Ligand
BDBM50081672
Substrate
Meas. Tech.
ChEMBL_30134 (CHEMBL641176)
Ki
6020±n/a nM
Citation
 Xie, RLi, AHJi, XDMelman, NOlah, MEStiles, GLJacobson, KA Selective A(3) adenosine receptor antagonists: water-soluble 3, 5-diacyl-1,2,4-trialkylpyridinium salts and their oxidative generation from dihydropyridine precursors. J Med Chem 42:4232-8 (1999)  
Target
Name:
Adenosine receptor A2a
Synonyms:
AA2AR_RAT Adenosine A2 receptor Adenosine Receptors A2a (A2a) Adenosine receptors A2a Rat striatal adenosine A2a receptor
Type:
G Protein-Coupled Receptor (GPCR)
Mol. Mass.:
45015.65
Organism:
Rattus norvegicus (rat)
Description:
Rat A2A receptors expressed in CHO cells.
Residue:
410
  
Inhibitor
Name:
BDBM50081672
Synonyms:
2-Butyl-5-ethoxycarbonyl-4-ethyl-3-ethylsulfanylcarbonyl-1-methyl-6-phenyl-pyridinium; iodide | CHEMBL337088
Type:
Small organic molecule
Emp. Form.:
C24H32NO3S
Mol. Mass.:
414.58
SMILES:
CCCCc1c(C(=O)SCC)c(CC)c(C(=O)OCC)c(-c2ccccc2)[n+]1C
: