Target
Dihydrofolate reductase
Ligand
BDBM50081922
Substrate
Meas. Tech.
ChEMBL_53497 (CHEMBL665621)
Ki
8.8±n/a nM
Citation
 Chowdhury, SFVillamor, VBGuerrero, RHLeal, IBrun, RCroft, SLGoodman, JMMaes, LRuiz-Perez, LMPacanowska, DGGilbert, IH Design, synthesis, and evaluation of inhibitors of trypanosomal and leishmanial dihydrofolate reductase. J Med Chem 42:4300-12 (1999)  
Target
Name:
Dihydrofolate reductase
Synonyms:
DHFR Dihydrofolate reductase (DHFR) | Tetrahydrofolate dehydrogenase
Type:
Enzyme
Mol. Mass.:
21453.99
Organism:
Homo sapiens (Human)
Description:
Recombinant human DHFR.
Residue:
187
  
Inhibitor
Name:
BDBM50081922
Synonyms:
5-(3-Isopropoxy-benzyl)-pyrimidine-2,4-diamine | CHEMBL334919
Type:
Small organic molecule
Emp. Form.:
C14H18N4O
Mol. Mass.:
258.3189
SMILES:
CC(C)Oc1cccc(Cc2cnc(N)nc2N)c1
: