Target
Transcriptional activator protein LasR
Ligand
BDBM50526999
Substrate
Meas. Tech.
ChEMBL_1901852 (CHEMBL4404074)
IC50
40000±n/a nM
Citation
 Chbib, C Impact of the structure-activity relationship of AHL analogues on quorum sensing in Gram-negative bacteria. Bioorg Med Chem 28:0 (2020)  
Target
Name:
Transcriptional activator protein LasR
Synonyms:
LASR_PSEAE | lasR
Type:
PROTEIN
Mol. Mass.:
26618.24
Organism:
Pseudomonas aeruginosa
Description:
ChEMBL_1475312
Residue:
239
  
Inhibitor
Name:
BDBM50526999
Synonyms:
CHEBI:63789 | CHEMBL458201
Type:
Small organic molecule
Emp. Form.:
C10H15NO4
Mol. Mass.:
213.2304
SMILES:
[H][C@@]1(CCOC1=O)NC(=O)CC(=O)CCC
: