Target
Sarcoplasmic/endoplasmic reticulum calcium ATPase 1
Ligand
BDBM20625
Substrate
Meas. Tech.
ChEMBL_1902018 (CHEMBL4404240)
IC50
14000±n/a nM
Citation
 Peterková, LKmoní?ková, ERuml, TRimpelová, S Sarco/Endoplasmic Reticulum Calcium ATPase Inhibitors: Beyond Anticancer Perspective. J Med Chem 63:1937-1963 (2020)  
Target
Name:
Sarcoplasmic/endoplasmic reticulum calcium ATPase 1
Synonyms:
AT2A1_RABIT Sarco/endoplasmic Reticulum Ca2+ ATPase 1 | Sarcoplasmic/endoplasmic reticulum calcium ATP-ase
Type:
PROTEIN
Mol. Mass.:
110435.34
Organism:
Oryctolagus cuniculus
Description:
ChEMBL_1500621
Residue:
1001
  
Inhibitor
Name:
BDBM20625
Synonyms:
4-[(3E)-4-(4-hydroxyphenyl)hex-3-en-3-yl]phenol CHEMBL411 Diethylstilbestrol (1) Stilboestroform
Type:
Small organic molecule
Emp. Form.:
C18H20O2
Mol. Mass.:
268.3502
SMILES:
CC\C(=C(\CC)c1ccc(O)cc1)c1ccc(O)cc1
: