Target
Sarcoplasmic/endoplasmic reticulum calcium ATPase 1
Ligand
BDBM36609
Substrate
Meas. Tech.
ChEMBL_1902028 (CHEMBL4404250)
IC50
77000±n/a nM
Citation
 Peterková, LKmoní?ková, ERuml, TRimpelová, S Sarco/Endoplasmic Reticulum Calcium ATPase Inhibitors: Beyond Anticancer Perspective. J Med Chem 63:1937-1963 (2020)  
Target
Name:
Sarcoplasmic/endoplasmic reticulum calcium ATPase 1
Synonyms:
AT2A1_RABIT Sarco/endoplasmic Reticulum Ca2+ ATPase 1 | Sarcoplasmic/endoplasmic reticulum calcium ATP-ase
Type:
PROTEIN
Mol. Mass.:
110435.34
Organism:
Oryctolagus cuniculus
Description:
ChEMBL_1500621
Residue:
1001
  
Inhibitor
Name:
BDBM36609
Synonyms:
Rapamycin C-7, analog 4 US11603377, Compound Ramycin
Type:
Small organic molecule
Emp. Form.:
C51H79NO13
Mol. Mass.:
914.1719
SMILES:
CO[C@@H]1C[C@H](C[C@@H](C)[C@@H]2CC(=O)[C@H](C)\C=C(C)\[C@@H](O)[C@@H](OC)C(=O)[C@H](C)C[C@H](C)\C=C\C=C\C=C(C)\[C@H](C[C@@H]3CC[C@@H](C)[C@@](O)(O3)C(=O)C(=O)N3CCCC[C@H]3C(=O)O2)OC)CC[C@H]1O
: