Target
Histone deacetylase 2b
Ligand
BDBM50082657
Substrate
Meas. Tech.
ChEMBL_87885 (CHEMBL698803)
IC50
300±n/a nM
Citation
 Jung, MBrosch, GKölle, DScherf, HGerhäuser, CLoidl, P Amide analogues of trichostatin A as inhibitors of histone deacetylase and inducers of terminal cell differentiation. J Med Chem 42:4669-79 (1999)  
Target
Name:
Histone deacetylase 2b
Synonyms:
Histone deacetylase HD2
Type:
PROTEIN
Mol. Mass.:
30785.07
Organism:
Zea mays
Description:
ChEMBL_87549
Residue:
286
  
Inhibitor
Name:
BDBM50082657
Synonyms:
4-Dimethylamino-N-(7-hydroxycarbamoyl-heptyl)-benzamide | CHEMBL143047
Type:
Small organic molecule
Emp. Form.:
C17H27N3O3
Mol. Mass.:
321.4146
SMILES:
CN(C)c1ccc(cc1)C(=O)NCCCCCCCC(=O)NO
: