Target
Alpha-1A adrenergic receptor
Ligand
BDBM50082851
Substrate
Meas. Tech.
ChEMBL_33741 (CHEMBL647056)
Ki
0.05±n/a nM
Citation
 Lagu, BTian, DNagarathnam, DMarzabadi, MRWong, WCMiao, SWZhang, FSun, WChiu, GFang, JForray, CChang, RSRansom, RWChen, TBO'Malley, SZhang, KVyas, KPGluchowski, C Design and synthesis of novel alpha(1)(a) adrenoceptor-selective antagonists. 3. Approaches to eliminate opioid agonist metabolites by using substituted phenylpiperazine side chains. J Med Chem 42:4794-803 (1999)  
Target
Name:
Alpha-1A adrenergic receptor
Synonyms:
ADA1A_HUMAN ADRA1C Alpha 1A-adrenoceptor Alpha adrenergic receptor 1a Alpha-adrenergic receptor 1c adrenergic Alpha1 | adrenergic Alpha1C
Type:
Cell-surface receptors
Mol. Mass.:
51511.67
Organism:
Homo sapiens (Human)
Description:
P35348
Residue:
466
  
Inhibitor
Name:
BDBM50082851
Synonyms:
4-(3,4-Difluoro-phenyl)-6-methyl-3-{3-[(R)-2-methyl-4-(2-nitro-phenyl)-piperazin-1-yl]-propylcarbamoyl}-2-oxo-1,2,3,4-tetrahydro-pyrimidine-5-carboxylic acid methyl ester | CHEMBL341849
Type:
Small organic molecule
Emp. Form.:
C28H32F2N6O6
Mol. Mass.:
586.5871
SMILES:
COC(=O)C1=C(C)NC(=O)N(C1c1ccc(F)c(F)c1)C(=O)NCCCN1CCN(C[C@H]1C)c1ccccc1[N+]([O-])=O
: