Target
5-hydroxytryptamine receptor 1D
Ligand
BDBM50083105
Substrate
Meas. Tech.
ChEMBL_1700 (CHEMBL616907)
IC50
1.7±n/a nM
Citation
 Russell, MGMatassa, VGPengilley, RRvan Niel, MBSohal, BWatt, APHitzel, LBeer, MSStanton, JABroughton, HBCastro, JL 3-[3-(Piperidin-1-yl)propyl]indoles as highly selective h5-HT(1D) receptor agonists. J Med Chem 42:4981-5001 (2000)  
Target
Name:
5-hydroxytryptamine receptor 1D
Synonyms:
5-HT-1D 5-HT1D 5HT1D_HUMAN HTR1DA Serotonin (5-HT) receptor | Serotonin Receptor 1D
Type:
G Protein-Coupled Receptor (GPCR)
Mol. Mass.:
41920.63
Organism:
Homo sapiens (Human)
Description:
Receptor binding assays were performed using human clone stably expressed in CHO cells.
Residue:
377
  
Inhibitor
Name:
BDBM50083105
Synonyms:
CHEMBL358072 | Pyridin-2-yl-{1-[3-(5-[1,2,4]triazol-4-yl-1H-indol-3-yl)-propyl]-piperidin-4-ylmethyl}-amine
Type:
Small organic molecule
Emp. Form.:
C24H29N7
Mol. Mass.:
415.534
SMILES:
C(CN1CCC(CNc2ccccn2)CC1)Cc1c[nH]c2ccc(cc12)-n1cnnc1
: