Target
5-hydroxytryptamine receptor 1D
Ligand
BDBM50083153
Substrate
Meas. Tech.
ChEMBL_1700 (CHEMBL616907)
IC50
1.9±n/a nM
Citation
 Russell, MGMatassa, VGPengilley, RRvan Niel, MBSohal, BWatt, APHitzel, LBeer, MSStanton, JABroughton, HBCastro, JL 3-[3-(Piperidin-1-yl)propyl]indoles as highly selective h5-HT(1D) receptor agonists. J Med Chem 42:4981-5001 (2000)  
Target
Name:
5-hydroxytryptamine receptor 1D
Synonyms:
5-HT-1D 5-HT1D 5HT1D_HUMAN HTR1DA Serotonin (5-HT) receptor | Serotonin Receptor 1D
Type:
G Protein-Coupled Receptor (GPCR)
Mol. Mass.:
41920.63
Organism:
Homo sapiens (Human)
Description:
Receptor binding assays were performed using human clone stably expressed in CHO cells.
Residue:
377
  
Inhibitor
Name:
BDBM50083153
Synonyms:
2-Phenyl-1'-[3-(5-[1,2,4]triazol-4-yl-1H-indol-3-yl)-propyl]-[1,4']bipiperidinyl | CHEMBL147838
Type:
Small organic molecule
Emp. Form.:
C29H36N6
Mol. Mass.:
468.6363
SMILES:
C(CN1CCC(CC1)N1CCCCC1c1ccccc1)Cc1c[nH]c2ccc(cc12)-n1cnnc1
: