Target
Epithelial discoidin domain-containing receptor 1
Ligand
BDBM50528533
Substrate
Meas. Tech.
ChEMBL_1905311 (CHEMBL4407669)
IC50
5.6±n/a nM
Citation
 Zhu, DHuang, HPinkas, DMLuo, JGanguly, DFox, AEArner, EXiang, QTu, ZCBullock, ANBrekken, RADing, KLu, X 2-Amino-2,3-dihydro-1 J Med Chem 62:7431-7444 (2019)  
Target
Name:
Epithelial discoidin domain-containing receptor 1
Synonyms:
CAK DDR1_HUMAN Discoidin domain-containing receptor 1 (DDR1) EDDR1 Epithelial discoidin domain receptor 1 (DDR1) Epithelial discoidin domain-containing receptor 1 (DDR1) Mammary carcinoma kinase 10 NTRK4 Protein-tyrosine kinase RTK 6 TRKE | Tyrosine-protein kinase CAK
Type:
Tyrosine-protein kinase
Mol. Mass.:
101130.02
Organism:
Homo sapiens (Human)
Description:
Q08345
Residue:
913
  
Inhibitor
Name:
BDBM50528533
Synonyms:
CHEMBL4558430
Type:
Small organic molecule
Emp. Form.:
C25H21F3N6O
Mol. Mass.:
478.469
SMILES:
Cc1cn(cn1)-c1cc(NC(=O)c2ccc3C[C@H](Cc3c2)Nc2cncnc2)cc(c1)C(F)(F)F
: