Target
Integrin alpha-IIb/beta-3
Ligand
BDBM50083455
Substrate
Meas. Tech.
ChEMBL_70187 (CHEMBL857389)
IC50
0.24±n/a nM
Citation
 Hoekstra, WJMaryanoff, BEDamiano, BPAndrade-Gordon, PCohen, JHCostanzo, MJHaertlein, BJHecker, LRHulshizer, BLKauffman, JAKeane, PMcComsey, DFMitchell, JAScott, LShah, RDYabut, SC Potent, orally active GPIIb/IIIa antagonists containing a nipecotic acid subunit. Structure-activity studies leading to the discovery of RWJ-53308. J Med Chem 42:5254-65 (2000)  
Target
Name:
Integrin alpha-IIb/beta-3
Synonyms:
Glycoprotein IIb/IIIa
Type:
Mol. Mass.:
Description:
ASSAY_ID of EBI is 30109
Components:
This complex has 2 components.
Component 1
Name:
Integrin beta-3
Synonyms:
CD_antigen=CD61 GPIIIa ITGB3 Platelet membrane glycoprotein IIIa
Type:
Protein
Mol. Mass.:
87038.91
Organism:
Homo sapiens (Human)
Description:
P05106
Residue:
788
  
Component 2
Name:
Integrin alpha-IIb
Synonyms:
CD_antigen=CD41 GPIIb Glycoprotein IIb ITGA2B Integrin alpha-IIb heavy chain Integrin alpha-IIb light chain, form 2 Integrin alpha-V/beta-3 and alpha-IIb/beta 3 | Platelet membrane glycoprotein IIb
Type:
Protein
Mol. Mass.:
113354.85
Organism:
Homo sapiens (Human)
Description:
P08514
Residue:
1039
  
Inhibitor
Name:
BDBM50083455
Synonyms:
(S)-3-(5-Ethynyl-pyridin-3-yl)-3-{[(R)-1-(3-piperidin-4-yl-propionyl)-piperidine-3-carbonyl]-amino}-propionic acid | CHEMBL358198
Type:
Small organic molecule
Emp. Form.:
C24H32N4O4
Mol. Mass.:
440.5353
SMILES:
OC(=O)C[C@H](NC(=O)[C@@H]1CCCN(C1)C(=O)CCC1CCNCC1)c1cncc(c1)C#C
: