Target
Tryptase beta-2/delta/gamma
Ligand
BDBM50083549
Substrate
Meas. Tech.
ChEMBL_210823 (CHEMBL811852)
Ki
1.1±n/a nM
Citation
 Ono, SKuwahara, STakeuchi, MSakashita, HNaito, YKondo, T Syntheses and evaluation of amidinobenzofuran derivatives as tryptase inhibitors. Bioorg Med Chem Lett 9:3285-90 (2000)  
Target
Name:
Tryptase beta-2/delta/gamma
Synonyms:
Tryptase
Type:
Mol. Mass.:
Description:
ASSAY_ID of ChEMBL is 1510505
Components:
This complex has 3 components.
Component 1
Name:
Tryptase gamma
Synonyms:
PRSS31 TMT TRYG1_HUMAN Tryptase Tryptase gamma heavy chain | Tryptase gamma light chain
Type:
PROTEIN
Mol. Mass.:
33817.52
Organism:
Homo sapiens (Human)
Description:
ChEMBL_210833
Residue:
321
  
Component 2
Name:
Tryptase beta-2
Synonyms:
TPS2 TRYB2_HUMAN Tryptase II Tryptase-2
Type:
PROTEIN
Mol. Mass.:
30518.79
Organism:
Homo sapiens (Human)
Description:
ChEMBL_210702
Residue:
275
  
Component 3
Name:
Tryptase delta
Synonyms:
Delta-tryptase Mast cell mMCP-7-like TRYD_HUMAN Tryptase-3
Type:
PROTEIN
Mol. Mass.:
26578.73
Organism:
Homo sapiens (Human)
Description:
ChEMBL_104777
Residue:
242
  
Inhibitor
Name:
BDBM50083549
Synonyms:
1-{4-[5-amino(imino)methylbenzo[b]furan-2-ylcarbonyl]hexahydro-1-pyrazinyl}-2-[2-(2-{4-[5-amino(imino)methylbenzo[b]furan-2-ylcarbonyl]hexahydro-1-pyrazinyl}-2-oxoethoxy)phenoxy]-1-ethanone | CHEMBL111643
Type:
Small organic molecule
Emp. Form.:
C38H38N8O8
Mol. Mass.:
734.7571
SMILES:
NC(=N)c1ccc2oc(cc2c1)C(=O)N1CCN(CC1)C(=O)COc1ccccc1OCC(=O)N1CCN(CC1)C(=O)c1cc2cc(ccc2o1)C(N)=N
: