Target
Muscarinic acetylcholine receptor M1
Ligand
BDBM50083651
Substrate
Meas. Tech.
ChEMBL_138477 (CHEMBL857565)
Ki
0.007943±n/a nM
Citation
 Krishnan, VPham, WNMesser, WSPeseckis, SM First fatty acylated dipeptides to affect muscarinic receptor ligand binding. Bioorg Med Chem Lett 9:3363-8 (2000)  
Target
Name:
Muscarinic acetylcholine receptor M1
Synonyms:
ACM1_HUMAN Cholinergic receptor, muscarinic 1 | Cholinergic, muscarinic M1
Type:
Protein
Mol. Mass.:
51442.54
Organism:
Homo sapiens (Human)
Description:
P11229
Residue:
460
  
Inhibitor
Name:
BDBM50083651
Synonyms:
(S)-3-Hydroxy-2-(2-tetradecanoylamino-acetylamino)-propionic acid benzyl ester | CHEMBL115078
Type:
Small organic molecule
Emp. Form.:
C26H42N2O5
Mol. Mass.:
462.6221
SMILES:
CCCCCCCCCCCCCC(=O)NCC(=O)N[C@@H](CO)C(=O)OCc1ccccc1
: