Target
Fatty-acid amide hydrolase 1
Ligand
BDBM50528930
Substrate
Meas. Tech.
ChEMBL_1906720 (CHEMBL4409078)
Ki
0.230000±n/a nM
Citation
 Grillo, AChemi, GBrogi, SBrindisi, MRelitti, NFezza, FFazio, DCastelletti, LPerdona, EWong, ALamponi, SPecorelli, ABenedusi, MFantacci, MValoti, MValacchi, GMicheli, FNovellino, ECampiani, GButini, SMaccarrone, MGemma, S Development of novel multipotent compounds modulating endocannabinoid and dopaminergic systems. Eur J Med Chem 183:0 (2019)  
Target
Name:
Fatty-acid amide hydrolase 1
Synonyms:
Anandamide amidohydrolase FAAH1_MOUSE Faah1 Fatty-acid amide hydrolase (FAAH) Oleamide hydrolase 1
Type:
Hydrolase; single-pass membrane protein; homodimer
Mol. Mass.:
63227.28
Organism:
Mus musculus (mouse)
Description:
Mouse brain membranes were used in the assay.
Residue:
579
  
Inhibitor
Name:
BDBM50528930
Synonyms:
CHEMBL4471658
Type:
Small organic molecule
Emp. Form.:
C25H28N4O4
Mol. Mass.:
448.5142
SMILES:
Cc1cc(C(N)=O)c(o1)-c1cccc(OC(=O)NCCN2CCN(CC2)c2ccccc2)c1
: