Target
Polyunsaturated fatty acid lipoxygenase ALOX15B
Ligand
BDBM50528936
Substrate
Meas. Tech.
ChEMBL_1906828 (CHEMBL4409186)
IC50
6000±n/a nM
Citation
 Czyzyk, DJValhondo, MDeiana, LTirado-Rives, JJorgensen, WLAnderson, KS Structure activity relationship towards design of cryptosporidium specific thymidylate synthase inhibitors. Eur J Med Chem 183:0 (2019)  
Target
Name:
Polyunsaturated fatty acid lipoxygenase ALOX15B
Synonyms:
Alox15b LX15B_RAT
Type:
PROTEIN
Mol. Mass.:
76140.88
Organism:
Rattus norvegicus
Description:
ChEMBL_12426
Residue:
677
  
Inhibitor
Name:
BDBM50528936
Synonyms:
CHEMBL4447274
Type:
Small organic molecule
Emp. Form.:
C23H21N5O5
Mol. Mass.:
447.4433
SMILES:
COCc1cccc(C(O)=O)c1NC(=O)c1ccc(Cc2c[nH]c3nc(N)[nH]c(=O)c23)cc1
: