Target
Polyunsaturated fatty acid lipoxygenase ALOX15B
Ligand
BDBM50528940
Substrate
Meas. Tech.
ChEMBL_1906828 (CHEMBL4409186)
IC50
470±n/a nM
Citation
 Czyzyk, DJValhondo, MDeiana, LTirado-Rives, JJorgensen, WLAnderson, KS Structure activity relationship towards design of cryptosporidium specific thymidylate synthase inhibitors. Eur J Med Chem 183:0 (2019)  
Target
Name:
Polyunsaturated fatty acid lipoxygenase ALOX15B
Synonyms:
Alox15b LX15B_RAT
Type:
PROTEIN
Mol. Mass.:
76140.88
Organism:
Rattus norvegicus
Description:
ChEMBL_12426
Residue:
677
  
Inhibitor
Name:
BDBM50528940
Synonyms:
CHEMBL4544605
Type:
Small organic molecule
Emp. Form.:
C21H17N5O4
Mol. Mass.:
403.3908
SMILES:
Nc1nc2[nH]cc(Cc3ccc(cc3)C(=O)Nc3ccc(cc3)C(O)=O)c2c(=O)[nH]1
: