Target
Polyunsaturated fatty acid lipoxygenase ALOX15B
Ligand
BDBM50528958
Substrate
Meas. Tech.
ChEMBL_1906828 (CHEMBL4409186)
IC50
600±n/a nM
Citation
 Czyzyk, DJValhondo, MDeiana, LTirado-Rives, JJorgensen, WLAnderson, KS Structure activity relationship towards design of cryptosporidium specific thymidylate synthase inhibitors. Eur J Med Chem 183:0 (2019)  
Target
Name:
Polyunsaturated fatty acid lipoxygenase ALOX15B
Synonyms:
Alox15b LX15B_RAT
Type:
PROTEIN
Mol. Mass.:
76140.88
Organism:
Rattus norvegicus
Description:
ChEMBL_12426
Residue:
677
  
Inhibitor
Name:
BDBM50528958
Synonyms:
CHEMBL4476613
Type:
Small organic molecule
Emp. Form.:
C22H19N5O5
Mol. Mass.:
433.4168
SMILES:
COc1ccc(C(O)=O)c(NC(=O)c2ccc(Cc3c[nH]c4nc(N)[nH]c(=O)c34)cc2)c1
: