Target
Prothrombin
Ligand
BDBM50083961
Substrate
Meas. Tech.
ChEBML_208342
Ki
9.4±n/a nM
Citation
 Soll, RMLu, TTomczuk, BIllig, CRFedde, CEisennagel, SBone, RMurphy, LSpurlino, JSalemme, FR Amidinohydrazones as guanidine bioisosteres: application to a new class of potent, selective and orally bioavailable, non-amide-based small-molecule thrombin inhibitors. Bioorg Med Chem Lett 10:1-4 (2000)  
Target
Name:
Prothrombin
Synonyms:
Activation peptide fragment 1 Coagulation factor II Prothrombin precursor Thrombin heavy chain | Thrombin light chain
Type:
Protein
Mol. Mass.:
70029.57
Organism:
Homo sapiens (Human)
Description:
P00734
Residue:
622
  
Inhibitor
Name:
BDBM50083961
Synonyms:
3-[((3E)-3-{[(E)-amino(imino)methyl]hydrazono}propyl)oxy]-5-methylphenyl 2,3-dichlorobenzenesulfonate | CHEMBL339011
Type:
Small organic molecule
Emp. Form.:
C17H18Cl2N4O4S
Mol. Mass.:
445.32
SMILES:
Cc1cc(OCCC=NNC(N)=N)cc(OS(=O)(=O)c2cccc(Cl)c2Cl)c1
: