Target
Adenosine receptor A3
Ligand
BDBM50084019
Substrate
Meas. Tech.
ChEBML_31409
Ki
1300±n/a nM
Citation
 Webb, TRMelman, NLvovskiy, DJi, XDJacobson, KA The utilization of a unified pharmacophore query in the discovery of new antagonists of the adenosine receptor family. Bioorg Med Chem Lett 10:31-4 (2000)  
Target
Name:
Adenosine receptor A3
Synonyms:
A3 adenosine receptor (hA3) ADORA3 | Adenosine A3 receptor (A3AR)
Type:
G Protein-Coupled Receptor (GPCR)
Mol. Mass.:
36197.32
Organism:
Homo sapiens (Human)
Description:
P0DMS8
Residue:
318
  
Inhibitor
Name:
BDBM50084019
Synonyms:
6,7-Dimethoxy-3-[4-(4-methoxy-phenyl)-thiazol-2-ylamino]-3H-isobenzofuran-1-one | CHEMBL114643
Type:
Small organic molecule
Emp. Form.:
C20H18N2O5S
Mol. Mass.:
398.432
SMILES:
COc1ccc(cc1)-c1csc(NC2OC(=O)c3c2ccc(OC)c3OC)n1
: